centrale hydroélectrique
terme associe: T96-1049
created: 2011-09-01T00:00:00+02:00
modified: 2015-02-19T15:57:33+01:00
status: 1
type: Concept
broader: T96-678
definition: Centrale électrique fonctionnant à l'énergie hydraulique et comprenant généralement un barrage, une conduite d'amenée, une salle des machines, un poste de transformation, etc.
in scheme: T96
narrower: T96-680
related: T96-1049