centrale nucléaire
created: 2011-09-01T00:00:00+02:00
modified: 2015-02-19T16:26:49+01:00
status: 1
type: Concept
alternative label: centrale atomique
broader: T96-678
definition: Centrale électrique fonctionnant à l'énergie nucléaire et comprenant un bâtiment réacteur, une salle des machines, une station de pompage ou une tour aéroréfrigérante, un poste de transformation, etc.
in scheme: T96