mine
created: 2011-09-01T00:00:00+02:00
modified: 2015-04-28T14:17:56+02:00
status: 1
type: Concept
broader: T96-686
definition: Exploitation, généralement souterraine, de substances concassables, minérales ou fossiles (houille, minerai métallique, potasse, sel, etc.) et comprenant généralement un puits d'extraction, un puits de service, un chevalement ou une tour d'extraction, un bâtiment de recette, etc.
in scheme: T96
narrower: T96-692