mine à ciel ouvert
created: 2011-09-01T00:00:00+02:00
modified: 2015-01-21T15:39:13+01:00
status: 1
type: Concept
broader: T96-691
definition: Exploitation à ciel ouvert de substances concassables, minérales ou fossiles et comprenant généralement une excavation en forme de gradins.
in scheme: T96