usine de préparation de produit minéral
created: 2011-09-01T00:00:00+02:00
modified: 2015-01-21T16:44:30+01:00
status: 1
type: Concept
broader: T96-686
definition: Usine où l'on fait subir aux produits minéraux bruts extraits (houille, minerais métalliques, uranium, kaolin, etc.) différents traitements (concassage, lavage, criblage, concentration) en vue de leur commercialisation. Elle comprend généralement une aire des matièrespremières , un poste de chargement, un bassin de décantation, un four industriel, etc.
in scheme: T96