usine de taille de pierre pour la joaillerie et l'industrie
created: 2011-09-01T00:00:00+02:00
modified: 2015-01-21T17:04:27+01:00
status: 1
type: Concept
broader: T96-686
definition: Usine où l'on taille la pierre précieuse (fine, fausse ou synthétique) utilisée en joaillerie et en horlogerie (contre-pivots) ainsi qu'à d'autres fins industrielles : diamants pour trépans, scies, etc.
in scheme: T96