usine d'estampage
created: 2011-09-01T00:00:00+02:00
modified: 2015-03-17T14:22:49+01:00
status: 1
type: Concept
broader: T96-713
definition: Usine où l'on façonne à froid des pièces de métal à l'aide de matrices afin de leur donner des formes et des dimensions déterminées. Elle fonctionne généralement avec des presses verticales, des balanciers à friction, etc.
in scheme: T96