tréfilerie
created: 2011-09-01T00:00:00+02:00
modified: 2015-03-17T15:22:56+01:00
status: 1
type: Concept
broader: T96-710
definition: Usine où s'effectue le tréfilage des métaux, en vue de la fabrication de fils. Elle comprend généralement une ou plusieurs filières de profil déterminé.
in scheme: T96