usine de construction métallique
created: 2011-09-01T00:00:00+02:00
modified: 2015-01-29T16:00:39+01:00
status: 1
type: Concept
broader: T96-720
definition: Usine où l'on fabrique des poutres, planchers, portails, grilles et mobilier métalliques. Elle comprend généralement un bureau d'études, un entrepôt industriel, un magasin industriel, etc.
in scheme: T96