usine de matériel agricole
created: 2011-09-01T00:00:00+02:00
modified: 2015-01-29T16:51:15+01:00
status: 1
type: Concept
broader: T96-720
definition: Usine où l'on fabrique des tracteurs, moissonneuses, etc., comprenant généralement un bureau d'études, une chaîne de fabrication, une aire des produits manufacturés, etc.
in scheme: T96