usine de matériel d'équipement industriel
created: 2011-09-01T00:00:00+02:00
modified: 2015-01-30T16:10:04+01:00
status: 1
type: Concept
broader: T96-720
definition: Usine où l'on fabrique des pompes, moteurs, engrenages, machines-outils, etc. Elle comprend généralement un entrepôt industriel, un magasin industriel, une aire des produits manufacturés, etc.
in scheme: T96