usine de petite métallurgie
created: 2011-09-01T00:00:00+02:00
modified: 2014-12-10T16:56:27+01:00
status: 1
type: Concept
broader: T96-675
definition: Usine qui fabrique des pièces de chaudronnerie, de robinetterie, de serrurerie, de quincaillerie, etc.
in scheme: T96
narrower: T96-732
narrower: T96-733
narrower: T96-734
narrower: T96-735
narrower: T96-736
narrower: T96-737
narrower: T96-738
narrower: T96-739