usine de décolletage
created: 2011-09-01T00:00:00+02:00
modified: 2014-12-15T12:53:43+01:00
status: 1
type: Concept
broader: T96-731
definition: Usine où l'on fabrique des petites pièces de visserie, de boulonnerie (boulons, écrous, goupilles, goujons, etc.) ou des pièces d'usinage plus complexe, telles que poulie de frein, volant d'embrayage automobile, etc. Elle fonctionne généralement avec des machines à usiner (type tour parallèle) semi-automatiques ou automatiques, et comprend souvent un magasin industriel, etc.
in scheme: T96