usine de mécanique de précision
created: 2011-09-01T00:00:00+02:00
modified: 2015-02-03T12:34:29+01:00
status: 1
type: Concept
broader: T96-675
definition: Usine où l'on fabrique des appareils de précision, de mesure, d'optique, d'équipement de bureau, etc.
in scheme: T96
narrower: T96-741
narrower: T96-742
narrower: T96-743
narrower: T96-744
narrower: T96-745
narrower: T96-746
narrower: T96-749