usine d'horlogerie
created: 2011-09-01T00:00:00+02:00
modified: 2015-02-03T12:48:15+01:00
status: 1
type: Concept
broader: T96-740
definition: Usine où l'on fabrique des montres, des pendules, des horloges, des cadrans, etc., comprenant généralement un bureau d'études, un magasin industriel, un atelier de conditionnement, etc.
in scheme: T96