usine d'instruments de mesure
created: 2011-09-01T00:00:00+02:00
modified: 2015-04-28T15:43:03+02:00
status: 1
type: Concept
broader: T96-740
definition: Usine où l'on fabrique balances, bascules, compteurs, niveaux, régulateurs, etc. et comprenant généralement un bureau d'études, un magasin industriel, etc.
in scheme: T96