usine d'instruments de musique
created: 2011-09-01T00:00:00+02:00
modified: 2015-02-03T13:04:23+01:00
status: 1
type: Concept
broader: T96-740
definition: Usine où l'on fabrique des instruments à cordes, à vent, à membranes, etc. et comprenant généralement un bureau d'études, un entrepôt industriel, un magasin industriel, un laboratoire, etc.
in scheme: T96