usine de matériel de bureau
created: 2011-09-01T00:00:00+02:00
modified: 2015-02-04T14:21:19+01:00
status: 1
type: Concept
broader: T96-740
definition: Usine où l'on fabrique des machines à écrire, à calculer, etc.
in scheme: T96