usine de matériel optique
created: 2011-09-01T00:00:00+02:00
modified: 2015-04-28T15:45:29+02:00
status: 1
type: Concept
broader: T96-740
definition: Usine où l'on fabrique des microscopes, jumelles, loupes, télescopes, etc.
in scheme: T96
narrower: T96-747
narrower: T96-748
scope note: Ce terme correspond à une usine de montage, la fabrication du verre optique étant effectuée dans une usine de verres optiques.