usine de construction électrique
created: 2011-09-01T00:00:00+02:00
modified: 2015-04-28T14:57:57+02:00
status: 1
type: Concept
broader: T96-675
definition: Usine où l'on fabrique divers matériels électriques, industriels ou domestiques.
in scheme: T96
narrower: T96-751
narrower: T96-752
narrower: T96-753
narrower: T96-754
narrower: T96-755