usine de matériel radioélectrique
created: 2011-09-01T00:00:00+02:00
modified: 2015-01-28T12:27:12+01:00
status: 1
type: Concept
broader: T96-750
definition: Usine où l'on fabrique du matériel pour la navigation, la communication, les orgues, etc. Elle comprend généralement un bureau d'études, un laboratoire, un poste de chargement, etc.
in scheme: T96