usine de construction électronique
created: 2011-09-01T00:00:00+02:00
modified: 2015-04-28T15:14:23+02:00
status: 1
type: Concept
broader: T96-675
definition: Usine où l'on fabrique divers matériels électroniques, électroacoustiques, informatiques et de télécommunication.
in scheme: T96
narrower: T96-757
narrower: T96-758
narrower: T96-759
narrower: T96-760