briqueterie
terme associe: T96-777
created: 2011-09-01T00:00:00+02:00
modified: 2015-01-23T16:38:57+01:00
status: 1
type: Concept
broader: T96-761
definition: Usine où l'on fabrique des briques et comprenant généralement un four industriel, une pièce de séchage, une excavation, etc.
in scheme: T96
related: T96-777