faïencerie
terme associe: T96-777
created: 2011-09-01T00:00:00+02:00
modified: 2015-01-23T17:02:22+01:00
status: 1
type: Concept
broader: T96-761
definition: Usine où l'on fabrique divers objets utilitaires ou décoratifs en faïence (glaçure à l'étain). Elle comprend généralement un entrepôt industriel, un four industriel, un magasin industriel, etc.
in scheme: T96
related: T96-777