usine de verre creux
created: 2011-09-01T00:00:00+02:00
modified: 2015-04-30T15:56:43+02:00
status: 1
type: Concept
broader: T96-768
definition: Usine où l'on fabrique de la gobeleterie : verres de table, gobelets, pichets, etc. Elle comprend généralement un four industriel, un magasin industriel, un entrepôt industriel, etc.
in scheme: T96
narrower: T96-772