usine de verre destiné a la chimie
created: 2011-09-01T00:00:00+02:00
modified: 2015-04-30T16:01:50+02:00
status: 1
type: Concept
broader: T96-772
definition: Usine où l'on fabrique divers récipients, instruments et équipements en verre, utilisés en laboratoire par les chimistes et les biologistes (pipettes, cornues, tubes à essais, éprouvettes, etc.). Elle comprend généralement un bureau, un four industriel, etc.
in scheme: T96