usine de verre plat
created: 2011-09-01T00:00:00+02:00
modified: 2015-04-23T10:58:44+02:00
status: 1
type: Concept
broader: T96-768
definition: Usine où l'on fabrique du verre à vitre par le procédé d'étirage. Elle comprend généralement un four industriel, un magasin industriel, etc.
in scheme: T96
narrower: T96-775