glacerie
created: 2011-09-01T00:00:00+02:00
modified: 2015-04-30T16:06:07+02:00
status: 1
type: Concept
broader: T96-774
definition: Usine où l'on fabrique des glaces de verre et des miroirs, par coulée, laminage, recuisson et traitement de surface. Elle comprend généralement un four industriel, un entrepôt industriel, etc.
in scheme: T96