usine de fabrication de matériaux de construction
terme associe: T96-762
terme associe: T96-763
terme associe: T96-764
created: 2011-09-01T00:00:00+02:00
modified: 2015-04-28T15:30:01+02:00
status: 1
type: Concept
broader: T96-675
definition: Usine où l'on fabrique différents types de matériaux de construction tels que plâtre, ciment, chaux, agglomérés ou préfabriqués.
in scheme: T96
narrower: T96-778
narrower: T96-779
narrower: T96-780
narrower: T96-781
narrower: T96-782
related: T96-762
related: T96-763
related: T96-764