usine d'agglomérés
created: 2011-09-01T00:00:00+02:00
modified: 2015-02-03T11:57:42+01:00
status: 1
type: Concept
broader: T96-777
definition: Usine où l'on fabrique des matériaux de construction (parpaings, etc.) et des éléments pour les travaux publics (poteaux, buses, etc.) obtenus à partir de matières diverses agrégées avec un liant, puis comprimées. Elle comprend généralement une aire des matièrespremières , un bureau, une aire des produits manufacturés, etc.
in scheme: T96