usine d'éléments préfabriqués
created: 2011-09-01T00:00:00+02:00
modified: 2015-04-28T15:36:00+02:00
status: 1
type: Concept
broader: T96-777
definition: Usine où l'on fabrique des panneaux dont l'assemblage forme un mur, une construction, etc. Elle comprend généralement une aire des produits manufacturés , un magasin industriel, un hangar, etc.
in scheme: T96