usine de produits chimiques
created: 2011-09-01T00:00:00+02:00
modified: 2015-02-06T15:35:02+01:00
status: 1
type: Concept
broader: T96-675
definition: Usine où l'on fabrique des produits de base, des produits issus de la pétrochimie, de la chimie phytosanitaire, de l'oléochimie et où l’on élabore des polymères, des produits pharmaceutiques ou de parfumerie, des peintures, etc.
in scheme: T96
narrower: T96-784
narrower: T96-786
narrower: T96-787
narrower: T96-788
narrower: T96-791
narrower: T96-792
narrower: T96-793
narrower: T96-794
narrower: T96-795
narrower: T96-796
narrower: T96-799
narrower: T96-805
narrower: T96-806
narrower: T96-807
narrower: T96-809
narrower: T96-810
narrower: T96-811
narrower: T96-812
narrower: T96-813
narrower: T96-814
narrower: T96-819