parfumerie
created: 2011-09-01T00:00:00+02:00
modified: 2015-02-06T16:07:46+01:00
status: 1
type: Concept
broader: T96-783
definition: Usine où l'on fabrique des parfums et des produits de toilette et de beauté : shampooings, dentifrices, etc. Elle comprend généralement un laboratoire, un réservoir industriel, un atelier de conditionnement, un magasin industriel, etc.
in scheme: T96
narrower: T96-785