ensemble religieux
created: 2011-09-01T00:00:00+02:00
modified: 2013-04-23T00:00:00+02:00
status: 1
type: Concept
broader: T96-78
definition: Ensemble à fonction religieuse constitué d'édifices ou d'édicules religieux.
in scheme: T96
narrower: T96-80
narrower: T96-81
narrower: T96-82
narrower: T96-84
narrower: T96-85
preferred label: religious communities @en-us