usine de fabrication et distillation des goudrons
created: 2011-09-01T00:00:00+02:00
modified: 2015-04-29T15:54:03+02:00
status: 1
type: Concept
broader: T96-783
definition: Usine où l'on fabrique des goudrons de houille, des goudrons de bois, etc. et comprenant généralement des réservoirs industriels, des distillateurs, un laboratoire, etc.
in scheme: T96