usine de matières plastiques
created: 2011-09-01T00:00:00+02:00
modified: 2015-04-29T16:12:03+02:00
status: 1
type: Concept
broader: T96-783
definition: Usine de matières plastiques thermodurcissables et thermoplastiques, telles que phénoplastes, aminoplastes, polyéthylène, polypropylène, polystyrène, polychlorure de vinyle, etc. Elle comprend généralement une chaufferie, un transformateur, un entrepôt industriel , etc.
in scheme: T96
narrower: T96-800
narrower: T96-801
narrower: T96-802
narrower: T96-803
narrower: T96-804