usine de produits d'entretien
created: 2011-09-01T00:00:00+02:00
modified: 2015-02-11T15:12:11+01:00
status: 1
type: Concept
broader: T96-783
definition: Usine où l'on fabrique encaustiques, désodorisants, insecticides ménagers, etc. Elle comprend généralement des ateliers de saponification ou de sulfonation, un atelier de conditionnement, un magasin industriel, etc.
in scheme: T96