usine d'allumettes
created: 2011-09-01T00:00:00+02:00
modified: 2015-02-11T16:25:55+01:00
status: 1
type: Concept
broader: T96-807
definition: Usine où l'on fabrique des allumettes de ménage ou de sûreté et comprenant généralement un entrepôt industriel, une pièce deséchage , un atelier de conditionnement, etc.
in scheme: T96