savonnerie
created: 2011-09-01T00:00:00+02:00
modified: 2015-04-29T16:52:34+02:00
status: 1
type: Concept
broader: T96-814
definition: Usine où l'on fabrique du savon sous différentes formes (solide, liquide, paillettes, etc.) par différents procédés de saponification, d'épuration, de liquidation, d'hydrolyse, etc. Elle comprend généralement un entrepôt industriel, un transformateur, etc.
in scheme: T96