usine de bougies
created: 2011-09-01T00:00:00+02:00
modified: 2015-02-18T11:59:50+01:00
status: 1
type: Concept
broader: T96-816
definition: Usine où l'on fabrique des chandelles, des cierges, des bougies suivant différents procédés (à « la jetée », à « la trempe », etc.). Elle comprend généralement un bureau, une chaufferie, un magasin industriel, etc.
in scheme: T96