usine de produits agro-alimentaires
created: 2011-09-01T00:00:00+02:00
modified: 2014-12-16T16:37:49+01:00
status: 1
type: Concept
alternative label: usine de produits alimentaires
broader: T96-675
definition: Usine où l'on transforme les produits d'origine animale ou végétale, issus de l'agriculture, en denrées alimentaires destinées à la consommation humaine et animale.
in scheme: T96
narrower: T96-821
narrower: T96-822
narrower: T96-823
narrower: T96-824
narrower: T96-825
narrower: T96-826
narrower: T96-827
narrower: T96-828
narrower: T96-830
narrower: T96-831
narrower: T96-832
narrower: T96-833
narrower: T96-834
narrower: T96-835
narrower: T96-837
narrower: T96-838
narrower: T96-840
narrower: T96-841
narrower: T96-844
narrower: T96-846
narrower: T96-848
narrower: T96-849
narrower: T96-850
narrower: T96-854
narrower: T96-855
narrower: T96-856