chocolaterie
created: 2011-09-01T00:00:00+02:00
modified: 2015-01-07T12:38:48+01:00
status: 1
type: Concept
broader: T96-820
definition: Usine où l'on fabrique du chocolat et comprenant généralement des machines de torréfaction, de broyage, de mélange, un atelier de conditionnement , un magasin industriel, etc.
in scheme: T96