confiserie
created: 2011-09-01T00:00:00+02:00
modified: 2015-04-29T14:46:15+02:00
status: 1
type: Concept
broader: T96-820
definition: Usine où l'on fabrique de la confiserie : sucreries, fruits confits, bonbons, confitures, etc. Elle comprend généralement un laboratoire, un atelier de conditionnement, un magasin industriel, etc.
in scheme: T96