ensemble cultuel
created: 2011-09-01T00:00:00+02:00
modified: 2014-09-30T17:25:00+02:00
status: 1
type: Concept
broad match: http://data.bnf.fr/ark:/12148/cb119347518
broad match: http://vocab.getty.edu/aat/300007391
broader: T96-79
definition: Ensemble constitué d'édifices ou édicules à vocation cultuelle.
in scheme: T96
narrower: T96-83