moulin à huile
terme associe: T96-589
terme associe: T96-676
terme associe: T96-832
created: 2011-09-01T00:00:00+02:00
modified: 2015-01-20T11:40:21+01:00
status: 1
type: Concept
broader: T96-820
definition: Usine où l’on presse différentes substances (olives, noix, graines, etc.) dans le but d'obtenir de l'huile. Elle comprend généralement un bief de dérivation, un bâtiment d'eau, un magasin industriel, etc.
in scheme: T96
related: T96-589
related: T96-676
related: T96-832