sucrerie
created: 2011-09-01T00:00:00+02:00
modified: 2015-04-29T15:15:06+02:00
status: 1
type: Concept
broader: T96-820
definition: Usine où l'on fabrique du sucre de betterave ou de canne. Elle est équipée de diffuseurs, de filtres-presses, de chaudières, de malaxeurs cristalliseurs, etc. Elle comprend généralement un pont-bascule, un hangar, un four à chaux, etc.
in scheme: T96
narrower: T96-839