usine de préparation d'un produit agroalimentaire
created: 2011-09-01T00:00:00+02:00
modified: 2013-04-23T00:00:00+02:00
status: 1
type: Concept
broader: T96-820
definition: Usine où l'on fait subir un premier traitement à un produit agricole (sélection, fermentation, grillage, râpage, germination, etc.) en vue de sa transformation industrielle.
in scheme: T96
narrower: T96-851
narrower: T96-852
narrower: T96-853