usine textile
created: 2011-09-01T00:00:00+02:00
modified: 2015-03-17T16:14:48+01:00
status: 1
type: Concept
broader: T96-675
definition: Usine où l'on traite et travaille les fibres textiles (filature, tissage, broderie, apprêt, teinture, etc.).
in scheme: T96
narrower: T96-858
narrower: T96-859
narrower: T96-860
narrower: T96-862
narrower: T96-865
narrower: T96-870
narrower: T96-871
narrower: T96-872
narrower: T96-873
narrower: T96-874
narrower: T96-875
narrower: T96-877