blanchisserie industrielle
terme associe: T96-609
created: 2011-09-01T00:00:00+02:00
modified: 2015-04-30T15:29:19+02:00
status: 1
type: Concept
broader: T96-857
definition: Usine où l'on effectue, suivant des procédés industriels, le nettoyage et le blanchissage du linge (triage, trempage, essangeage, lessivage, savonnage, rinçage, essorage, séchage, calandrage, repassage). Elle comprend généralement un entrepôt industriel, une pièce de séchage, une chaufferie, etc.
in scheme: T96
related: T96-609
scope note: Ne pas confondre avec usine de blanchiment.