quartier canonial
terme associe: T96-29
created: 2011-09-01T00:00:00+02:00
modified: 2014-10-23T10:40:34+02:00
status: 1
type: Concept
alternative label: cloître (ensemble)
alternative label: cloître canonial
alternative label: ensemble canonial
broader: T96-79
definition: Complexe formé par les habitations et les édifices nécessaires aux chanoines du chapitre d’une cathédrale ou d'une collégiale.
in scheme: T96
preferred label: canonica @it
related: T96-29
scope note: Au Moyen Âge, il est souvent clos de portes et de murs, ou de bâtiments.